{"text_format":"1","workbook":"xlsx","n_sheets":10,"sheets":["Prezenční listina","Startovní listina","Výsledková listina","Běh přes přehradu","mezičasy 2017","mezičasy tisk","Diplom MSM A5","Diplom MSM A5 (2)","Družstva (prac.)","Výsledková listina (2)"],"not_rendered":{"charts":0,"images":18,"macros":1,"external_links":0,"defined_names":12,"comments":0,"pivot_tables":0},"unopened":[],"bounds":{"document_bytes":16777216,"sheet_cells":100000,"rows_first":2000,"rows_last":500,"rows_between":2000,"halvings":0,"cell_chars":16384,"cell_head_chars":4096},"cells_cut":0,"cells_raw":0,"read":"whole","date_system":"1900"}

{"sheet":"Prezenční listina","index":0,"n_rows":152,"n_cols":25,"rows_kept":152,"cut":false,"hidden":true,"merged":[[5,16,5,18],[0,0,0,10]]}
[{"$f":"\"Prezenční listina - Bystřickem kolem Vírské přehrady \"&U2","v":"Prezenční listina - Bystřickem kolem Vírské přehrady 2018"}]
["Kategorie","#","Startovní číslo","Příjmení","Jméno","Rok narození","M / Ž","E-mail","Telefon","Město","Tým","Datum registrace","Zaplaceno?","VS",null,null,null,null,null,null,2018,null,null,null,"Pohlaví"]
[{"$f":"IF(Y3<>\"Ž\",IF($U$2-F3>39,IF($U$2-F3>49,IF($U$2-F3>59,IF($U$2-F3>69,IF($U$2-F3>90,\"\",\"E\"),\"D\"),\"C\"),\"B\"),\"A\"),IF(Y3=\"Ž\",IF($U$2-F3>34,IF($U$2-F3>44,IF($U$2-F3>90,\"\",\"H\"),\"G\"),\"F\")))","v":"B"},1,42,"Fritscher","Adam",1975,"Muž","ambo@email.cz",736533790,null,"TJ Liga 100 Olomouc","2018-05-26","Nezaplaceno",74737479,null,null,null,null,null,null,null,null,null,null,{"$f":"IF(LEN(D3)=0,\" \",IF(MID(D3,LEN(D3),1)=\"á\",\"Ž\",\"M\"))","v":"M"}]
["F",2,41,"Matějíková","Jana",1990,"Žena","matejikova.jana@centrum.cz",721162550,null,"TJ Liga 100 Olomouc","2018-05-26","Nezaplaceno",19763815,null,null,null,null,null,null,null,null,null,null,"Ž"]
["A",3,36,"Hradecký","Jaromír",1985,"Muž","jaromirhradecky@gmail.com",720474536,"Skuteč",null,"2018-05-26","Nezaplaceno",80027669,null,null,null,null,null,null,null,null,null,null,"M"]
["A",4,34,"Oberreiter","Martin",1988,"Muž","bionic7@seznam.cz",725563450,"Polná",null,"2018-05-26","Nezaplaceno",90732247,null,null,"Rok nastavit v buňce T2",null,null,null,null,null,null,null,"M"]
["B",5,33,"Pohanka","Martin",1973,"Muž","mpohanka@centrum.cz",734420358,null,"Track & Field Brno","2018-05-26","Nezaplaceno",79113638,null,null,null,null,null,null,null,null,null,null,"M"]
["C",6,30,"Dvořáček","Jiří",1968,"Muž","dvorjiri@cntrum.cz",730902579,null,"Elite Sport Max Training","2018-05-26","Nezaplaceno",34640308,null,null,null,null,null,null,null,null,null,null,"M"]
["A",7,29,"Šebánek","Petr",1979,"Muž","petrseban@seznam.cz",608410908,"Rájec",null,"2018-05-26","Nezaplaceno",32959754,null,null,null,null,null,null,null,null,null,null,"M"]
["A",8,27,"Kohut","Jan",1985,"Muž","hkohut@seznam.cz",777975754,null,"Univerzita Brno","2018-05-26","Nezaplaceno",50709775,null,null,null,null,null,null,null,null,null,null,"M"]
{"$rows_left_out":143}
{"sheet":"Startovní listina","index":1,"n_rows":152,"n_cols":13,"rows_kept":152,"cut":false,"hidden":false,"merged":[[4,12,11,12],[0,0,0,7],[2,0,2,7],[1,0,1,7],[1,9,2,10]]}
[{"$f":"\"Startovní listina - Bystřickem kolem Vírské přehrady \"&'Prezenční listina'!U2","v":"Startovní listina - Bystřickem kolem Vírské přehrady 2018"}]
["2018-05-26",null,null,null,null,null,null,null,null,"Počet přihlášených v jednotlivých kategoriích"]
[{"$f":"'Prezenční listina'!U2-2004&\". ročník\"","v":"14. ročník"},null,null,null,null,null,null,null,null,null,null,null,"Celkem startujících"]
["#","Startovní číslo","Příjmení","Jméno","Narození","Město","Tým","Kategorie"]
[1,{"$f":"IF('Prezenční listina'!C48=0,\"\",'Prezenční listina'!C48)","v":1},{"$f":"IF('Prezenční listina'!C48=0,\"\",'Prezenční listina'!D48)","v":"Hübner"},{"$f":"IF('Prezenční listina'!C48=0,\"\",'Prezenční listina'!E48)","v":"Tomáš"},{"$f":"IF('Prezenční listina'!C48=0,\"\",'Prezenční listina'!F48)","v":1979},{"$f":"IF('Prezenční listina'!C48=0,\"\",'Prezenční listina'!J48)","v":"Brno"},{"$f":"IF('Prezenční listina'!C48=0,\"\",'Prezenční listina'!K48)","v":"SDH Bolešín"},{"$f":"IF('Prezenční listina'!C48=0,\"\",'Prezenční listina'!A48)","v":"A"},null,"A:",{"$f":"COUNTIF($H$5:$H$141,\"A\")","v":15},null,{"$f":"COUNT(B5:B141)","v":44}]
[{"$f":"IF(B6=\"\",\"\",A5+1)","v":2},{"$f":"IF('Prezenční listina'!C17=0,\"\",'Prezenční listina'!C17)","v":2},{"$f":"IF('Prezenční listina'!C17=0,\"\",'Prezenční listina'!D17)","v":"Kuneš"},{"$f":"IF('Prezenční listina'!C17=0,\"\",'Prezenční listina'!E17)","v":"David"},{"$f":"IF('Prezenční listina'!C17=0,\"\",'Prezenční listina'!F17)","v":1974},{"$f":"IF('Prezenční listina'!C17=0,\"\",'Prezenční listina'!J17)","v":"Tišnov"},{"$f":"IF('Prezenční listina'!C17=0,\"\",'Prezenční listina'!K17)","v":"EURUNNER"},{"$f":"IF('Prezenční listina'!C17=0,\"\",'Prezenční listina'!A17)","v":"B"},null,"B:",{"$f":"COUNTIF($H$5:$H$141,\"B\")","v":11}]
[{"$f":"IF(B7=\"\",\"\",A6+1)","v":3},{"$f":"IF('Prezenční listina'!C16=0,\"\",'Prezenční listina'!C16)","v":3},{"$f":"IF('Prezenční listina'!C16=0,\"\",'Prezenční listina'!D16)","v":"Hanák"},{"$f":"IF('Prezenční listina'!C16=0,\"\",'Prezenční listina'!E16)","v":"Jakub"},{"$f":"IF('Prezenční listina'!C16=0,\"\",'Prezenční listina'!F16)","v":1986},{"$f":"IF('Prezenční listina'!C16=0,\"\",'Prezenční listina'!J16)","v":"Vír"},{"$f":"IF('Prezenční listina'!C16=0,\"\",'Prezenční listina'!K16)","v":"Plant Powered Runners"},{"$f":"IF('Prezenční listina'!C16=0,\"\",'Prezenční listina'!A16)","v":"A"},null,"C:",{"$f":"COUNTIF($H$5:$H$141,\"C\")","v":8}]
[4,{"$f":"IF('Prezenční listina'!C39=0,\"\",'Prezenční listina'!C39)","v":4},{"$f":"IF('Prezenční listina'!C39=0,\"\",'Prezenční listina'!D39)","v":"Pešáková"},{"$f":"IF('Prezenční listina'!C39=0,\"\",'Prezenční listina'!E39)","v":"Mirka"},{"$f":"IF('Prezenční listina'!C39=0,\"\",'Prezenční listina'!F39)","v":1985},{"$f":"IF('Prezenční listina'!C39=0,\"\",'Prezenční listina'!J39)","v":"Tetčice"},{"$f":"IF('Prezenční listina'!C39=0,\"\",'Prezenční listina'!K39)","v":"AC Racers"},{"$f":"IF('Prezenční listina'!C39=0,\"\",'Prezenční listina'!A39)","v":"F"},null,"D:",{"$f":"COUNTIF($H$5:$H$141,\"D\")","v":1}]
[5,{"$f":"IF('Prezenční listina'!C49=0,\"\",'Prezenční listina'!C49)","v":5},{"$f":"IF('Prezenční listina'!C49=0,\"\",'Prezenční listina'!D49)","v":"Hrdina"},{"$f":"IF('Prezenční listina'!C49=0,\"\",'Prezenční listina'!E49)","v":"Tomáš"},{"$f":"IF('Prezenční listina'!C49=0,\"\",'Prezenční listina'!F49)","v":1979},{"$f":"IF('Prezenční listina'!C49=0,\"\",'Prezenční listina'!J49)","v":"Rosice"},{"$f":"IF('Prezenční listina'!C49=0,\"\",'Prezenční listina'!K49)","v":"AC Moravská Slavia Brno"},{"$f":"IF('Prezenční listina'!C49=0,\"\",'Prezenční listina'!A49)","v":"A"},null,"E:",{"$f":"COUNTIF($H$5:$H$141,\"E\")","v":1}]
[6,{"$f":"IF('Prezenční listina'!C18=0,\"\",'Prezenční listina'!C18)","v":6},{"$f":"IF('Prezenční listina'!C18=0,\"\",'Prezenční listina'!D18)","v":"Šerák"},{"$f":"IF('Prezenční listina'!C18=0,\"\",'Prezenční listina'!E18)","v":"Martin"},{"$f":"IF('Prezenční listina'!C18=0,\"\",'Prezenční listina'!F18)","v":1978},{"$f":"IF('Prezenční listina'!C18=0,\"\",'Prezenční listina'!J18)","v":0},{"$f":"IF('Prezenční listina'!C18=0,\"\",'Prezenční listina'!K18)","v":"Sokol Bílovice n. Svit."},{"$f":"IF('Prezenční listina'!C18=0,\"\",'Prezenční listina'!A18)","v":"B"},null,"F:",{"$f":"COUNTIF($H$5:$H$141,\"F\")","v":4}]
{"$rows_left_out":143}
{"sheet":"Výsledková listina","index":2,"n_rows":103,"n_cols":12,"rows_kept":103,"cut":false,"hidden":false,"merged":[[0,0,0,9],[2,0,2,9],[1,0,1,9],[1,11,12,15]]}
[{"$f":"\"Výsledková listina - Bystřickem kolem Vírské přehrady \"&'Prezenční listina'!U2","v":"Výsledková listina - Bystřickem kolem Vírské přehrady 2018"}]
[{"$f":"'Startovní listina'!A2:H2","v":"2018-05-26"},null,null,null,null,null,null,null,null,null,null,"\nPoté, co jsou dopsány časy VŠECH běžců, stisknout tlačítko 1.řazení \n\n\nVe sloupci B (Pořadí v kategorii) vytvořit posloupnou číselnou řadu pro každou kategorii a poté stisknout tlačítko 2.řazení\n\n\n                      !!! POZOR!!!\n\n               Použití tlačítek je nevratný krok!"]
[{"$f":"'Startovní listina'!A3:H3","v":"14. ročník"}]
["Celkové pořadí","Pořadí v kategorii","Kategorie","Startovní číslo","Příjmení","Jméno","Narození","Město","Tým","Čas"]
[1,1,"A",27,"Kohut","Jan",1985,null,"Univerzita Brno","01:47:49"]
[{"$f":"IF('Výsledková listina'!D5<>\"\",A5+1,\"\")","v":2},2,"A",36,"Hradecký","Jaromír",1985,"Skuteč",null,"01:49:08"]
[{"$f":"IF('Výsledková listina'!D6<>\"\",A6+1,\"\")","v":3},3,"A",29,"Šebánek","Petr",1979,"Rájec",null,"01:49:37"]
[{"$f":"IF('Výsledková listina'!D19<>\"\",A7+1,\"\")","v":4},1,"B",35,"Vintrlík","Martin",1977,"Křepice","Triatlon Křepice","01:50:54"]
[{"$f":"IF('Výsledková listina'!D20<>\"\",A8+1,\"\")","v":5},2,"B",33,"Pohanka","Martin",1973,null,"Track & Field Brno","01:51:50"]
[{"$f":"IF('Výsledková listina'!D7<>\"\",A9+1,\"\")","v":6},4,"A",43,"Glier","Michal",1982,"Doubravník","SDH Doubravník","01:52:23"]
{"$rows_left_out":94}
{"sheet":"Běh přes přehradu","index":3,"n_rows":52,"n_cols":11,"rows_kept":52,"cut":false,"hidden":false,"merged":[[0,0,0,7],[1,0,1,7]]}
[{"$f":"'Startovní listina'!A3:H3&\" Běhu přes přehradu \"&'Prezenční listina'!U2","v":"14. ročník Běhu přes přehradu 2018"}]
[{"$f":"'Startovní listina'!A2:H2","v":"2018-05-26"}]
[null,"Příjmení","Jméno","Narození","Oddíl / Bydliště","Startovní číslo","Čas","Pohlaví"]
[1,"Králík","Luděk",2000,"Brno",106,"00:17:04",{"$f":"IF(LEN(B4)=0,\" \",IF(MID(B4,LEN(B4),1)=\"á\",\"Ž\",\"M\"))","v":"M"}]
[{"$f":"IF(B5=\"\",\"\",A4+1)","v":2},"Bednář","Jan",1992,"Polná",102,"00:17:34","M"]
[{"$f":"IF(B6=\"\",\"\",A5+1)","v":3},"Štýbnar","Štěpán",2003,"PTEAM",112,"00:17:41","M"]
[4,"Coural","Jaroslav",2002,"Vír",103,"00:18:00","M"]
[5,"Jonáš","Jakub",2003,"SK ANTE, Žďár nad Sázavou",105,"00:18:28","M",null,null,","]
[6,"Janů","Petr",2003,"Hlinné",104,"00:19:04","M"]
[7,"Pohanka","Tomáš",2009,"Drásov",108,"00:20:10","M"]
{"$rows_left_out":43}
{"sheet":"mezičasy 2017","index":4,"n_rows":14,"n_cols":6,"rows_kept":14,"cut":false,"hidden":true,"merged":[[0,0,0,1],[0,2,0,3],[0,4,0,5]]}
["5. km",null,"10. km",null,"22. km"]
["číslo","čas","číslo","čas","číslo","čas"]
[51,"00:18:47",51,"00:36:23",24,"01:22:30"]
[24,"00:18:59",24,"00:36:27",51,"01:23:12"]
[69,"00:20:00",69,"00:39:24",10,"01:29:22"]
[37,"00:20:17",49,"00:39:30",36,"01:30:12"]
[49,"00:20:20",37,"00:39:32",49,"01:30:12"]
[10,"00:20:52",36,"00:40:03",69,"01:30:59"]
[36,"00:20:52",10,"00:40:03",null,":        :"]
[38,"00:21:06",23,"00:40:57",null,":        :"]
{"$rows_left_out":5}
{"sheet":"mezičasy tisk","index":5,"n_rows":24,"n_cols":6,"rows_kept":24,"cut":false,"hidden":true,"merged":[[0,0,0,1],[0,2,0,3],[0,4,0,5]]}
["5. km",null,"10. km",null,"22. km"]
["číslo","čas","číslo","čas","číslo","čas"]
[null,":        :",null,":        :",null,":        :"]
[null,":        :",null,":        :",null,":        :"]
[null,":        :",null,":        :",null,":        :"]
[null,":        :",null,":        :",null,":        :"]
[null,":        :",null,":        :",null,":        :"]
[null,":        :",null,":        :",null,":        :"]
[null,":        :",null,":        :",null,":        :"]
[null,":        :",null,":        :",null,":        :"]
{"$rows_left_out":15}
{"sheet":"Diplom MSM A5","index":6,"n_rows":36,"n_cols":13,"rows_kept":36,"cut":false,"hidden":true,"merged":[[26,3,28,10],[29,6,31,6],[31,3,34,3],[32,12,33,13],[35,6,36,9]]}
[]
[]
[]
[]
[]
[]
[]
[]
[]
[]
{"$rows_left_out":27}
{"sheet":"Diplom MSM A5 (2)","index":7,"n_rows":36,"n_cols":13,"rows_kept":36,"cut":false,"hidden":true,"merged":[[26,3,28,10],[29,6,31,6],[31,3,34,3],[32,12,33,13],[35,6,36,9]]}
[]
[]
[]
[]
[]
[]
[]
[]
[]
[]
{"$rows_left_out":27}
{"sheet":"Družstva (prac.)","index":8,"n_rows":21,"n_cols":11,"rows_kept":21,"cut":false,"hidden":true,"merged":[[19,1,20,1],[19,6,20,6],[19,8,20,8],[15,1,16,1],[15,6,16,6],[15,8,16,8],[17,1,18,1],[17,6,18,6],[17,8,18,8],[11,1,12,1],[11,6,12,6],[11,8,12,8],[13,1,14,1],[13,6,14,6],[13,8,14,8],[7,1,8,1],[7,6,8,6],[7,8,8,8],[9,1,10,1],[9,6,10,6],[9,8,10,8],[5,1,6,1],[5,6,6,6],[5,8,6,8],[0,1,0,8],[1,1,1,8],[3,1,4,1],[3,6,4,6],[3,8,4,8]]}
[null,{"$f":"\"Výsledková listina - Malý svratecký maratón \"&'Prezenční listina'!U2&\" - družstva\"","v":"Výsledková listina - Malý svratecký maratón 2018 - družstva"}]
[null,{"$f":"'Prezenční listina'!U2-1953&\". ročník\"","v":"65. ročník"}]
[null,"Pořadí","Startovní číslo","Příjmení","Jméno","Narození","Oddíl / Bydliště","Čas","Výsledný čas"]
[null,"1.",3,{"$f":"IF(ISERROR(VLOOKUP(C4,'Startovní listina'!$B$5:$G$141,2)),\"\",VLOOKUP(C4,'Startovní listina'!$B$5:$G$141,2))","v":"Hanák"},{"$f":"IF(ISERROR(VLOOKUP(C4,'Startovní listina'!$B$5:$G$141,3)),\"\",VLOOKUP(C4,'Startovní listina'!$B$5:$G$141,3))","v":"Jakub"},{"$f":"IF(ISERROR(VLOOKUP(C4,'Startovní listina'!$B$5:$G$141,4)),\"\",VLOOKUP(C4,'Startovní listina'!$B$5:$G$141,4))","v":1986},{"$f":"IF(K4=K5,K4,\"RŮZNÉ ODDÍLY !!!\")","v":"RŮZNÉ ODDÍLY !!!"},"03:07:50",{"$f":"IF((H4=0),\"\",H4+H5)","v":"05:48:15"},null,{"$f":"IF(ISERROR(VLOOKUP(C4,'Startovní listina'!$B$5:$G$141,5)),\"\",VLOOKUP(C4,'Startovní listina'!$B$5:$G$141,5))","v":"Vír"}]
[null,null,2,{"$f":"IF(ISERROR(VLOOKUP(C5,'Startovní listina'!$B$5:$G$141,2)),\"\",VLOOKUP(C5,'Startovní listina'!$B$5:$G$141,2))","v":"Kuneš"},{"$f":"IF(ISERROR(VLOOKUP(C5,'Startovní listina'!$B$5:$G$141,3)),\"\",VLOOKUP(C5,'Startovní listina'!$B$5:$G$141,3))","v":"David"},{"$f":"IF(ISERROR(VLOOKUP(C5,'Startovní listina'!$B$5:$G$141,4)),\"\",VLOOKUP(C5,'Startovní listina'!$B$5:$G$141,4))","v":1974},null,"02:40:25",null,null,{"$f":"IF(ISERROR(VLOOKUP(C5,'Startovní listina'!$B$5:$G$141,5)),\"\",VLOOKUP(C5,'Startovní listina'!$B$5:$G$141,5))","v":"Tišnov"}]
[null,"2.",11,{"$f":"IF(ISERROR(VLOOKUP(C6,'Startovní listina'!$B$5:$G$141,2)),\"\",VLOOKUP(C6,'Startovní listina'!$B$5:$G$141,2))","v":"Vrba"},{"$f":"IF(ISERROR(VLOOKUP(C6,'Startovní listina'!$B$5:$G$141,3)),\"\",VLOOKUP(C6,'Startovní listina'!$B$5:$G$141,3))","v":"Tomáš"},{"$f":"IF(ISERROR(VLOOKUP(C6,'Startovní listina'!$B$5:$G$141,4)),\"\",VLOOKUP(C6,'Startovní listina'!$B$5:$G$141,4))","v":1986},{"$f":"IF(K6=K7,K6,\"RŮZNÉ ODDÍLY !!!\")","v":"RŮZNÉ ODDÍLY !!!"},"02:01:16",{"$f":"IF((H6=0),\"\",H6+H7)","v":"04:06:56"},null,{"$f":"IF(ISERROR(VLOOKUP(C6,'Startovní listina'!$B$5:$G$141,5)),\"\",VLOOKUP(C6,'Startovní listina'!$B$5:$G$141,5))","v":"Bystré"}]
[null,null,8,{"$f":"IF(ISERROR(VLOOKUP(C7,'Startovní listina'!$B$5:$G$141,2)),\"\",VLOOKUP(C7,'Startovní listina'!$B$5:$G$141,2))","v":"Faja"},{"$f":"IF(ISERROR(VLOOKUP(C7,'Startovní listina'!$B$5:$G$141,3)),\"\",VLOOKUP(C7,'Startovní listina'!$B$5:$G$141,3))","v":"Ondřej"},{"$f":"IF(ISERROR(VLOOKUP(C7,'Startovní listina'!$B$5:$G$141,4)),\"\",VLOOKUP(C7,'Startovní listina'!$B$5:$G$141,4))","v":1976},null,"02:05:40",null,null,{"$f":"IF(ISERROR(VLOOKUP(C7,'Startovní listina'!$B$5:$G$141,5)),\"\",VLOOKUP(C7,'Startovní listina'!$B$5:$G$141,5))","v":"Brno"}]
[null,"3.",9,{"$f":"IF(ISERROR(VLOOKUP(C8,'Startovní listina'!$B$5:$G$141,2)),\"\",VLOOKUP(C8,'Startovní listina'!$B$5:$G$141,2))","v":"Labedz"},{"$f":"IF(ISERROR(VLOOKUP(C8,'Startovní listina'!$B$5:$G$141,3)),\"\",VLOOKUP(C8,'Startovní listina'!$B$5:$G$141,3))","v":"Jan"},{"$f":"IF(ISERROR(VLOOKUP(C8,'Startovní listina'!$B$5:$G$141,4)),\"\",VLOOKUP(C8,'Startovní listina'!$B$5:$G$141,4))","v":1984},{"$f":"IF(K8=K9,K8,\"RŮZNÉ ODDÍLY !!!\")","v":"RŮZNÉ ODDÍLY !!!"},"02:40:16",{"$f":"IF((H8=0),\"\",H8+H9)","v":"05:12:53"},null,{"$f":"IF(ISERROR(VLOOKUP(C8,'Startovní listina'!$B$5:$G$141,5)),\"\",VLOOKUP(C8,'Startovní listina'!$B$5:$G$141,5))","v":"Svinošice"}]
[null,null,10,{"$f":"IF(ISERROR(VLOOKUP(C9,'Startovní listina'!$B$5:$G$141,2)),\"\",VLOOKUP(C9,'Startovní listina'!$B$5:$G$141,2))","v":"Štýbnar"},{"$f":"IF(ISERROR(VLOOKUP(C9,'Startovní listina'!$B$5:$G$141,3)),\"\",VLOOKUP(C9,'Startovní listina'!$B$5:$G$141,3))","v":"Zbyněk"},{"$f":"IF(ISERROR(VLOOKUP(C9,'Startovní listina'!$B$5:$G$141,4)),\"\",VLOOKUP(C9,'Startovní listina'!$B$5:$G$141,4))","v":1974},null,"02:32:37",null,null,{"$f":"IF(ISERROR(VLOOKUP(C9,'Startovní listina'!$B$5:$G$141,5)),\"\",VLOOKUP(C9,'Startovní listina'!$B$5:$G$141,5))","v":0}]
[null,"4.",23,{"$f":"IF(ISERROR(VLOOKUP(C10,'Startovní listina'!$B$5:$G$141,2)),\"\",VLOOKUP(C10,'Startovní listina'!$B$5:$G$141,2))","v":"Šimunek"},{"$f":"IF(ISERROR(VLOOKUP(C10,'Startovní listina'!$B$5:$G$141,3)),\"\",VLOOKUP(C10,'Startovní listina'!$B$5:$G$141,3))","v":"Martin"},{"$f":"IF(ISERROR(VLOOKUP(C10,'Startovní listina'!$B$5:$G$141,4)),\"\",VLOOKUP(C10,'Startovní listina'!$B$5:$G$141,4))","v":1966},{"$f":"IF(K10=K11,K10,\"RŮZNÉ ODDÍLY !!!\")","v":"RŮZNÉ ODDÍLY !!!"},"03:04:10",{"$f":"IF((H10=0),\"\",H10+H11)","v":"06:10:48"},null,{"$f":"IF(ISERROR(VLOOKUP(C10,'Startovní listina'!$B$5:$G$141,5)),\"\",VLOOKUP(C10,'Startovní listina'!$B$5:$G$141,5))","v":"Modřice"}]
{"$rows_left_out":12}
{"sheet":"Výsledková listina (2)","index":9,"n_rows":103,"n_cols":11,"rows_kept":103,"cut":false,"hidden":true,"merged":[[0,0,0,8],[1,0,1,8],[1,10,12,14],[2,0,2,8]]}
[{"$f":"\"Výsledková listina - Malý svratecký maraton \"&'Prezenční listina'!U2","v":"Výsledková listina - Malý svratecký maraton 2018"}]
["2015-08-22",null,null,null,null,null,null,null,null,null,"\nPoté, co jsou dopsány časy VŠECH běžců, stisknout tlačítko 1.řazení \n\n\nVe sloupci B (Pořadí v kategorii) vytvořit posloupnou číselnou řadu pro každou kategorii a poté stisknout tlačítko 2.řazení\n\n\n                      !!! POZOR!!!\n\n               Použití tlačítek je nevratný krok!"]
[{"$f":"'Prezenční listina'!U2-1953&\". ročník\"","v":"65. ročník"}]
["Celkové pořadí","Pořadí v kategorii","Kategorie","Startovní číslo","Příjmení","Jméno","Narození","Oddíl / Bydliště","Čas"]
[1,1,{"$f":"'Startovní listina'!H47","v":"A"},{"$f":"'Startovní listina'!B47","v":43},{"$f":"'Startovní listina'!C47","v":"Glier"},{"$f":"'Startovní listina'!F47","v":"Doubravník"},{"$f":"'Startovní listina'!G47","v":"SDH Doubravník"},{"$f":"'Startovní listina'!#REF!","v":{"$error":"#REF!"}},"02:19:48"]
[{"$f":"IF('Výsledková listina (2)'!D5<>\"\",A5+1,\"\")","v":2},null,{"$f":"'Startovní listina'!H71","v":""},{"$f":"'Startovní listina'!B71","v":""},{"$f":"'Startovní listina'!C71","v":""},{"$f":"'Startovní listina'!F71","v":""},{"$f":"'Startovní listina'!G71","v":""},{"$f":"'Startovní listina'!#REF!","v":{"$error":"#REF!"}},"02:47:00"]
[{"$f":"IF('Výsledková listina (2)'!D6<>\"\",A6+1,\"\")","v":""},null,{"$f":"'Startovní listina'!H5","v":"A"},{"$f":"'Startovní listina'!B5","v":1},{"$f":"'Startovní listina'!C5","v":"Hübner"},{"$f":"'Startovní listina'!F5","v":"Brno"},{"$f":"'Startovní listina'!G5","v":"SDH Bolešín"},{"$f":"'Startovní listina'!#REF!","v":{"$error":"#REF!"}},"03:02:17"]
[{"$f":"IF('Výsledková listina (2)'!D7<>\"\",A7+1,\"\")","v":{"$error":"#VALUE!"}},null,{"$f":"'Startovní listina'!H85","v":""},{"$f":"'Startovní listina'!B85","v":""},{"$f":"'Startovní listina'!C85","v":""},{"$f":"'Startovní listina'!F85","v":""},{"$f":"'Startovní listina'!G85","v":""},{"$f":"'Startovní listina'!#REF!","v":{"$error":"#REF!"}},"03:28:11"]
[{"$f":"IF('Výsledková listina (2)'!D8<>\"\",A8+1,\"\")","v":""},null,{"$f":"'Startovní listina'!H59","v":""},{"$f":"'Startovní listina'!B59","v":""},{"$f":"'Startovní listina'!C59","v":""},{"$f":"'Startovní listina'!F59","v":""},{"$f":"'Startovní listina'!G59","v":""},{"$f":"'Startovní listina'!#REF!","v":{"$error":"#REF!"}},"02:23:11"]
[{"$f":"IF('Výsledková listina (2)'!D9<>\"\",A9+1,\"\")","v":""},null,{"$f":"'Startovní listina'!H46","v":"B"},{"$f":"'Startovní listina'!B46","v":42},{"$f":"'Startovní listina'!C46","v":"Fritscher"},{"$f":"'Startovní listina'!F46","v":0},{"$f":"'Startovní listina'!G46","v":"TJ Liga 100 Olomouc"},{"$f":"'Startovní listina'!#REF!","v":{"$error":"#REF!"}},"02:50:33"]
{"$rows_left_out":93}